{"text_format":"1","workbook":"xlsx","n_sheets":2,"sheets":["AP list","antennas"],"not_rendered":{"charts":0,"images":0,"macros":0,"external_links":0,"defined_names":0,"comments":1,"pivot_tables":0},"unopened":[],"bounds":{"document_bytes":16777216,"sheet_cells":100000,"rows_first":2000,"rows_last":500,"rows_between":2000,"halvings":0,"cell_chars":16384,"cell_head_chars":4096},"cells_cut":0,"cells_raw":0,"read":"whole","date_system":"1900"}

{"sheet":"AP list","index":0,"n_rows":8,"n_cols":23,"rows_kept":8,"cut":false,"hidden":false,"merged":[]}
["site_name","lat","lon","ap_name","ap_elevation_ft","radio_model","antenna_model","antenna_name","ap_antenna_gain","antenna_id","tx_power_dbm","frequency_mhz","channel_width_mhz","azimuth","beamwidth","avg_noise_floor_dbm","coverage_radius_mi","max_advertised_download_speed","max_advertised_upload_speed","residential","business","licensed","technology"]
["Site 1",33.941809999999997,-91.843469999999996,"S1AP1",100,"Epmp 3000","AH60-TP",{"$f":"IF(G2=\"Other\",\"\",G2)","v":"AH60-TP"},{"$f":"IF(G2=\"Other\",\"\",VLOOKUP(G2,antennas!$B$2:$D$286,3,0))","v":17},{"$f":"IF(G2=\"Other\",\"\",VLOOKUP(G2,antennas!$B$2:$E$286,4,0))","v":66},24,5310,20,0,60,-80,3,25,10,1,1,"unlicensed","wifi"]
["Site 1",33.941809999999997,-91.843469999999996,"S1AP2",100,"Epmp 3000","Other",{"$f":"IF(G3<>\"Other\",G3,\"\")","v":""},{"$f":"IF(G3=\"Other\",\"\",VLOOKUP(G3,antennas!$B$2:$D$286,3,0))","v":""},{"$f":"IF(G3=\"Other\",\"\",VLOOKUP(G3,antennas!$B$2:$E$286,4,0))","v":""},24,5330,20,120,60,-80,3,25,10,1,1,"unlicensed","wifi"]
["Site 1",33.941809999999997,-91.843469999999996,"S1AP3",100,"Epmp 3000","AH90-TP",{"$f":"IF(G4<>\"Other\",G4,\"''\")","v":"AH90-TP"},{"$f":"IF(G4=\"Other\",\"\",VLOOKUP(G4,antennas!$B$2:$D$286,3,0))","v":16},{"$f":"IF(G4=\"Other\",\"\",VLOOKUP(G4,antennas!$B$2:$E$286,4,0))","v":65},24,5350,20,240,60,-80,3,25,10,1,1,"unlicensed","wifi"]
["Site 1",33.941809999999997,-91.843469999999996,"S1AP1",100,"Baicells","AH90-TP",{"$f":"IF(G5<>\"Other\",G5,\"''\")","v":"AH90-TP"},{"$f":"IF(G5=\"Other\",\"\",VLOOKUP(G5,antennas!$B$2:$D$286,3,0))","v":16},{"$f":"IF(G5=\"Other\",\"\",VLOOKUP(G5,antennas!$B$2:$E$286,4,0))","v":65},24,3650,20,0,60,-80,3,25,10,1,1,"gaa","LTE"]
["Site 1",33.941809999999997,-91.843469999999996,"S1AP2",100,"Baicells","AH60-TP",{"$f":"IF(G6<>\"Other\",G6,\"''\")","v":"AH60-TP"},{"$f":"IF(G6=\"Other\",\"\",VLOOKUP(G6,antennas!$B$2:$D$286,3,0))","v":17},{"$f":"IF(G6=\"Other\",\"\",VLOOKUP(G6,antennas!$B$2:$E$286,4,0))","v":66},24,3660,20,120,60,-80,3,25,10,1,1,"gaa","LTE"]
["Site 1",33.941809999999997,-91.843469999999996,"S1AP3",100,"Baicells","AH60-TP",{"$f":"IF(G7<>\"Other\",G7,\"''\")","v":"AH60-TP"},{"$f":"IF(G7=\"Other\",\"\",VLOOKUP(G7,antennas!$B$2:$D$286,3,0))","v":17},{"$f":"IF(G7=\"Other\",\"\",VLOOKUP(G7,antennas!$B$2:$E$286,4,0))","v":66},24,3670,20,240,60,-80,3,25,10,1,1,"pal","LTE"]
["Site 1",33.941809999999997,-91.843469999999996,"S1AP3",100,"Cambium 450","AH60-TP",{"$f":"IF(G8<>\"Other\",G8,\"''\")","v":"AH60-TP"},{"$f":"IF(G8=\"Other\",\"\",VLOOKUP(G8,antennas!$B$2:$D$286,3,0))","v":17},{"$f":"IF(G8=\"Other\",\"\",VLOOKUP(G8,antennas!$B$2:$E$286,4,0))","v":66},24,2540,20,240,60,-80,3,25,10,1,1,"educational","FPGA (Cambium PMP)"]

{"sheet":"antennas","index":1,"n_rows":286,"n_cols":5,"rows_kept":286,"cut":false,"hidden":false,"merged":[]}
[null,"Other",null,null,0]
[null,"A5-360","Airspan",14,167]
[null,"Airspeed 1030 ","Airspan",17,326]
[null,"B5","Airspan",25,164]
[null,"N5-360","Airspan",15,165]
[null,"N5-45x2","Airspan",19,166]
[null,"AW3007_T4","Alpha Wireless",17.7,324]
[null,"AW3023_T0","Alpha Wireless",18,325]
[null,"BLiNQ-FW300i","BLiNQ Networks",17,315]
[null,"BLiNQ-FW300i-S0-(+55)","BLiNQ Networks",16.399999999999999,316]
[null,"BLiNQ-FW300i-S1-(0)","BLiNQ Networks",17,317]
[null,"BLiNQ-FW300i-S2-(-55)","BLiNQ Networks",16.8,318]
[null,"BLiNQ-X300i","BLiNQ Networks",12,319]
[null,"BLiNQ_CPE_CAT12","BLiNQ Networks",12,320]
[null,"BLiNQ_CPE_CAT12HG","BLiNQ Networks",15.2,321]
[null,"BLiNQ_CPE_CAT6","BLiNQ Networks",15,322]
[null,"BLiNQ_CPE_CAT6HG","BLiNQ Networks",18,323]
[null,"AW3014","Baicells",17.7,314]
[null,"Atom-OD04-H_CAT4-19dBi","Baicells",19,309]
[null,"Atom-OD04-L_CAT6-14dBi","Baicells",14,310]
[null,"Atom-OD15-18dBi","Baicells",18,311]
[null,"Baicells_Nova430_BANT3537-X-13.5T6-BDA","Baicells",13.5,313]
[null,"Nova227_pbs2120","Baicells",13.3,312]
[null,"ATOM ID06","Baicells ",6.5,308]
[null,"3GHz_450_SM_Integrated55","Cambium Networks",8,168]
[null,"3GHz_450_SM_Reflector6","Cambium Networks",19,169]
[null,"3GHz_450i_AP_Sector90","Cambium Networks",17,170]
[null,"3GHz_450i_SM_Integrated17","Cambium Networks",19,171]
[null,"3GHz_450m_AP_Sector120-90","Cambium Networks",15.5,172]
[null,"3GHz_PMP450b_SM","Cambium Networks",20.8,173]
[null,"5.1GHz_PMP450m_AP_Sector90-120","Cambium Networks",15.4,174]
[null,"5.1GHz_ePMP2000_AP_Sector90","Cambium Networks",18,175]
[null,"5.1GHz_ePMP3000_AP_Sector90","Cambium Networks",16.8,176]
[null,"5.1GHz_ePMP4500_AP_Sector90","Cambium Networks",17.5,328]
[null,"5.5GHz_PMP450m_AP_Sector90-120","Cambium Networks",15.4,177]
[null,"5.5GHz_ePMP2000_AP_Sector90","Cambium Networks",18,178]
[null,"5.5GHz_ePMP3000_AP_Sector90","Cambium Networks",15.9,179]
[null,"5.5GHz_ePMP4500_AP_Sector90","Cambium Networks",17.2,329]
[null,"5.8GHz_PMP450m_AP_Sector90-120","Cambium Networks",15.4,180]
[null,"5.8GHz_ePMP2000_AP_Sector90","Cambium Networks",18,181]
[null,"5.8GHz_ePMP2000_AP_Sector90","Cambium Networks",18,182]
[null,"5.8GHz_ePMP3000_AP_Sector90","Cambium Networks",16,183]
[null,"5.9GHz_ePMP4500_AP_Sector90","Cambium Networks",17.899999999999999,333]
[null,"5.9GHz_ePMP4600_AP_Sector90","Cambium Networks",16.600000000000001,334]
[null,"5GHz_ePMP_Force300-25","Cambium Networks",25,185]
[null,"5GPMP450_Micropop_Sector","Cambium Networks",13.9,186]
[null,"6.1GHz_ePMP4600_AP_Sector90","Cambium Networks",17.600000000000001,335]
[null,"6.4GHz_ePMP4600_AP_Sector90","Cambium Networks",17.7,336]
[null,"6.7GHz_ePMP4600_AP_Sector90","Cambium Networks",17.8,337]
[null,"7.0GHz_ePMP4600_AP_Sector90","Cambium Networks",18,338]
[null,"900MHz_450i_AP_Sector90","Cambium Networks",13.7,187]
[null,"Force 180","Cambium Networks",15.9,327]
[null,"PMP450-5G90","Cambium Networks",17,184]
[null,"ePMP_1000_2.4 GHz_Sector_90_120","Cambium Networks",14.9,340]
[null,"ePMP_1000_5GHz_120_C050900D002","Cambium Networks",14,341]
[null,"KP-23DOMNI-HV","KP",11.5,189]
[null,"KP-23DOMNI-HV","KP",10,188]
[null,"KP-25DOMNI-HV","KP",12,191]
[null,"KP-25DOMNI-HV","KP",12,190]
[null,"KP-2DP120S-45","KP",14.5,194]
[null,"KP-2DP120S-45-PMP","KP",14.5,192]
[null,"KP-2DP120S-45-WC","KP",14.5,193]
[null,"KP-2SX4-33","KP",18.5,195]
[null,"KP-35DOMNI-HV","KP",11,196]
[null,"KP-35DOMNI-HV","KP",12,197]
[null,"KP-3DP120S-45","KP",15,198]
[null,"KP-3DP33S-45","KP",18.8,199]
[null,"KP-3DP65S-45","KP",17.7,200]
[null,"KP-3S3S-65SA","KP",17.5,201]
[null,"KP-3S3S-65SA","KP",17.5,202]
[null,"KP-3SX4-33","KP",18.8,203]
[null,"KP-3SX4N-65","KP",17.7,204]
[null,"KP-3SX4N-65","KP",17.7,206]
[null,"KP-5DP45S-45","KP",20,207]
[null,"KP-5DP45S-45","KP",20,205]
[null,"KP-5HVX8-65","KP",17.5,209]
[null,"KP-5HVX8-65","KP",16.5,208]
[null,"KP-5OMNI-EPMP3K-KIT","KP",13,210]
[null,"KP-5PDC5C-1","KP",24.5,211]
[null,"KP-5PDC5C-2","KP",29.5,212]
[null,"KP-5PDN-1","KP",24.5,213]
[null,"KP-5PDN-2","KP",29.5,214]
[null,"KP-5PDUIS5-1","KP",24.5,215]
[null,"KP-5PDUIS5-2","KP",29.5,216]
[null,"KP-5QOMNI-13","KP",13,217]
[null,"KP-5SX4-45","KP",20,218]
[null,"KP-900-DPOMA-45","KP",10,219]
[null,"KP-900DP120S-45","KP",12.5,221]
[null,"KP-900DP120S-45-PMP","KP",12.5,220]
[null,"KP-TWDP65S-12-45","KP",12.5,222]
[null,"KP-TWDPFP9","KP",8.5,223]
[null,"KP-TWDPY9","KP",9,224]
[null,"KP-TWVP65S-12","KP",12.5,225]
[null,"KPP-2HV5HVX8-65","KP",16.8,227]
[null,"KPP-2HV5HVX8-65","KP",16.8,226]
[null,"KPP-2S3SX4-65","KP",17.2,228]
[null,"KPP-2S3SX8-65","KP",17.2,229]
[null,"KPP-2S3SX8-65","KP",16.8,230]
[null,"KPP-2S5SX8-65","KP",17.2,231]
[null,"KPP-2S5SX8-65","KP",17,232]
[null,"KPP-2SX4-65","KP",17.2,233]
[null,"KPP-3DP65S-45","KP",18.100000000000001,234]
[null,"KPP-3S65-5S90-X4","KP",17,236]
[null,"KPP-3S65-5S90-X4","KP",17.8,235]
[null,"KPP-3S65-5S90-X8","KP",17,240]
[null,"KPP-3S65-5S90-X8","KP",17.8,239]
[null,"KPP-3S65-5S90-X8-0DT","KP",17,238]
[null,"KPP-3S65-5S90-X8-0DT","KP",17.8,237]
[null,"KPP-3SX4-65","KP",18.100000000000001,241]
[null,"KPP-5DP90S-45","KP",17,242]
[null,"KPP-5SX4-65","KP",17.5,243]
[null,"KPP-5SX8-65","KP",17.5,244]
[null,"KPPA-22-2GHZDPFHA","KP",20.5,245]
[null,"KPPA-22.5-3GHZDPFHA","KP",22.5,248]
[null,"KPPA-24-2GHZDPFHA-4P","KP",24,246]
[null,"KPPA-29-5GHZDPFHA","KP",27,249]
[null,"KPPA-2GHZ-DPOMA-WC","KP",13,251]
[null,"KPPA-2GHZ-DPOMA-WC-2","KP",13,250]
[null,"KPPA-2GHZDP120S-45","KP",14.2,254]
[null,"KPPA-2GHZDP120S-45-PMP","KP",14.2,252]
[null,"KPPA-2GHZDP120S-WC","KP",14.2,253]
[null,"KPPA-2GHZDP120S-WC","KP",14.2,255]
[null,"KPPA-2GHZDP60S-17-45","KP",15.1,256]
[null,"KPPA-2GHZDP65S-WC1","KP",15.5,257]
[null,"KPPA-2GHZDP65S-WOC1","KP",15.5,258]
[null,"KPPA-2GHZDP90S-45","KP",17,261]
[null,"KPPA-2GHZDP90S-45-PMP","KP",17,259]
[null,"KPPA-2GHZDP90S-45-WC","KP",17,260]
[null,"KPPA-2GHZDP90S-WC","KP",17,262]
[null,"KPPA-2HV5HV-90SS","KP",15.8,264]
[null,"KPPA-2HV5HV-90SS","KP",15.2,263]
[null,"KPPA-2S2S-65SA","KP",17.5,265]
[null,"KPPA-2S2S-65SA","KP",17.5,266]
[null,"KPPA-2S5HV-90SS","KP",15.8,268]
[null,"KPPA-2S5HV-90SS","KP",15.8,267]
[null,"KPPA-3GHZ-DPOMA","KP",13,272]
[null,"KPPA-3GHZ-DPOMA-WC","KP",13,271]
[null,"KPPA-3GHZ-DPOMA-WC-2","KP",13,270]
[null,"KPPA-3GHZDP120S-45","KP",14.2,273]
[null,"KPPA-3GHZDP90S-45","KP",16.5,275]
[null,"KPPA-3GHZDP90S-45-PMP","KP",16.5,274]
[null,"KPPA-3GHZFHLD-4P","KP",25.5,247]
[null,"KPPA-3S3S-65SA","KP",16.5,276]
[null,"KPPA-3S3S-65SA","KP",16.5,277]
[null,"KPPA-3S3S-65SS","KP",17.5,278]
[null,"KPPA-3S5HV-90SS","KP",15.8,279]
[null,"KPPA-3S5HV-90SS","KP",14.9,280]
[null,"KPPA-5GHZ-DPOMA","KP",14,284]
[null,"KPPA-5GHZ-DPOMA-MT","KP",14,281]
[null,"KPPA-5GHZ-DPOMA-WC","KP",14,283]
[null,"KPPA-5GHZ-DPOMA-WC-2","KP",14,282]
[null,"KPPA-5GHZDP120S","KP",16.3,288]
[null,"KPPA-5GHZDP120S-PMP","KP",16.3,285]
[null,"KPPA-5GHZDP120S-WC","KP",16.3,286]
[null,"KPPA-5GHZDP120S-WC","KP",16.3,287]
[null,"KPPA-5GHZDP40S-17","KP",18,289]
[null,"KPPA-5GHZDP40S-WC","KP",18,290]
[null,"KPPA-5GHZDP60S-17","KP",17.7,291]
[null,"KPPA-5GHZDP60S-WC","KP",17.7,292]
[null,"KPPA-5GHZDP90S","KP",17,295]
[null,"KPPA-5GHZDP90S-PMP","KP",17,293]
[null,"KPPA-5GHZDP90S-WC","KP",17,294]
[null,"KPPA-5GHZFHLD-4P","KP",30.5,269]
[null,"KPPA-5GHZHV4P65-17","KP",17.5,297]
[null,"KPPA-5GHZHV4P65-17","KP",16.5,296]
[null,"KPPA-5HV5HV-65SA","KP",16.5,298]
[null,"KPPA-5HV5HV-65SA","KP",16.5,299]
[null,"KPPA-900-120-11.5","KP",11.5,300]
[null,"KPPA-900DP-90S","KP",12.5,302]
[null,"KPPA-900DP-90S-PMP","KP",12.5,301]
[null,"KPPA-900DP-FP","KP",13.5,303]
[null,"KPPA-900DPY14","KP",14.5,304]
[null,"KPPA-900DPY17","KP",17.5,305]
[null,"KPPA-OMNI-DP-2.4-45","KP",10.5,306]
[null,"KPPA-OMNI-DP-3GHZ-45","KP",11,307]
[null,"AH2030-TP","RF elements s.r.o.",20.5,61]
[null,"AH3020-TP","RF elements s.r.o.",20.5,51]
[null,"AH60-TP","RF elements s.r.o.",17,66]
[null,"AH90-TP","RF elements s.r.o.",16,65]
[null,"AS-2-14","RF elements s.r.o.",14,57]
[null,"AS-2-17","RF elements s.r.o.",17,59]
[null,"AS-3-17DS","RF elements s.r.o.",17,45]
[null,"AS-3-17HV","RF elements s.r.o.",17.5,55]
[null,"AS-3-18DS","RF elements s.r.o.",18,44]
[null,"AS-5-20","RF elements s.r.o.",20,48]
[null,"AS-5-20","RF elements s.r.o.",20,58]
[null,"HG3-TP-S30","RF elements s.r.o.",18.399999999999999,64]
[null,"HG3-TP-S40","RF elements s.r.o.",16.2,47]
[null,"HG3-TP-S50","RF elements s.r.o.",14.3,49]
[null,"HG3-TP-S60","RF elements s.r.o.",13.2,53]
[null,"HG3-TP-S70","RF elements s.r.o.",11.5,43]
[null,"HG3-TP-S80","RF elements s.r.o.",10.4,60]
[null,"HG3-TP-S90","RF elements s.r.o.",9.6,50]
[null,"STD-21-UM","RF elements s.r.o.",21,56]
[null,"STD-24-UM","RF elements s.r.o.",24,63]
[null,"STD-27-UM","RF elements s.r.o.",27,42]
[null,"STH-30-USMA","RF elements s.r.o.",18,54]
[null,"STH-A45-USMA","RF elements s.r.o.",17,68]
[null,"UD-TP-21","RF elements s.r.o.",21.2,52]
[null,"UD-TP-24","RF elements s.r.o.",24.4,62]
[null,"UD-TP-27","RF elements s.r.o.",27.5,67]
[null,"UH-TP-5-24","RF elements s.r.o.",24,46]
[null,"Tarana_BN_3GHz_Compact_R0","Tarana Wireless Inc.",22.5,142]
[null,"Tarana_BN_5GHz_R0","Tarana Wireless Inc.",17.649999999999999,143]
[null,"Tarana_RN_3GHz_R0","Tarana Wireless Inc.",18.5,144]
[null,"Tarana_RN_5GHz_R0","Tarana Wireless Inc.",21.9,145]
[null,"AF-11G35-S45","Ubiquiti",35,109]
[null,"AF-24Tx","Ubiquiti",35,76]
[null,"AF-5G23-S45","Ubiquiti",23,69]
[null,"AF-5G30-S45-AM","Ubiquiti",30,103]
[null,"AF5","Ubiquiti",26,108]
[null,"AG-2G16","Ubiquiti",16,94]
[null,"AG-2G16U","Ubiquiti",16,104]
[null,"AG-2G20","Ubiquiti",21,114]
[null,"AG-5G23","Ubiquiti",23,98]
[null,"AG-5G27","Ubiquiti",27,77]
[null,"AM-2G15-120","Ubiquiti",15,162]
[null,"AM-2G16-90","Ubiquiti",16,81]
[null,"AM-3G18-120","Ubiquiti",18,127]
[null,"AM-5G-Lite","Ubiquiti",15.5,75]
[null,"AM-5G16-120","Ubiquiti",16,73]
[null,"AM-5G17-90","Ubiquiti",17,130]
[null,"AM-5G19-120","Ubiquiti",19,71]
[null,"AM-5G20-90","Ubiquiti",20,72]
[null,"AM-9M13-90","Ubiquiti",13,84]
[null,"AM-M521-60-AC","Ubiquiti",21,83]
[null,"AM-M522-45-AC","Ubiquiti",22,128]
[null,"AMO-2G10","Ubiquiti",10,101]
[null,"AMO-2G13","Ubiquiti",13,92]
[null,"AMO-3G12","Ubiquiti",12,74]
[null,"AMO-5G10","Ubiquiti",10,97]
[null,"AMO-5G13","Ubiquiti",13,95]
[null,"AMY-9M16","Ubiquiti",16,85]
[null,"AP-5AC-90-HD","Ubiquiti",22,116]
[null,"AP-5AC-90-HD","Ubiquiti",22,106]
[null,"AP-5AC-90-HD","Ubiquiti",22,100]
[null,"IsoAP-5-45-V","Ubiquiti",15,150]
[null,"LAPGPS_V","Ubiquiti",17,139]
[null,"LBE-5AC-16-120","Ubiquiti",16,161]
[null,"LBE-5AC-19","Ubiquiti",19,147]
[null,"LBE-5AC-Gen2","Ubiquiti",23,149]
[null,"LBE-5AC-LR","Ubiquiti",26,146]
[null,"LBE-M5-23","Ubiquiti",23,119]
[null,"LOCOM2","Ubiquiti",8.5,126]
[null,"LOCOM5","Ubiquiti",14.3,70]
[null,"LOCOM9","Ubiquiti",7.5,111]
[null,"NB-2G18","Ubiquiti",18,110]
[null,"NB-5G22","Ubiquiti",22,112]
[null,"NB-5G25","Ubiquiti",25,124]
[null,"NBE-2AC-13","Ubiquiti",13,148]
[null,"NBE-5AC-19","Ubiquiti",19,157]
[null,"NBE-5AC-Gen2","Ubiquiti",19,151]
[null,"NBE-M2-13","Ubiquiti",13,90]
[null,"NBE-M5-16","Ubiquiti",16,131]
[null,"NBE-M5-19","Ubiquiti",19,122]
[null,"NBM3","Ubiquiti",22,115]
[null,"NBM9","Ubiquiti",11,80]
[null,"NSLoco5AC","Ubiquiti",13,158]
[null,"NSM2","Ubiquiti",11,105]
[null,"NSM3","Ubiquiti",13,89]
[null,"NSM5","Ubiquiti",15,86]
[null,"NanoStation5AC","Ubiquiti",16,152]
[null,"PBE-2AC-400","Ubiquiti",18,153]
[null,"PBE-5AC-400","Ubiquiti",23,159]
[null,"PBE-5AC-400-ISO","Ubiquiti",25,154]
[null,"PBE-Feed","Ubiquiti",8,121]
[null,"PBE-M2-400","Ubiquiti",18,125]
[null,"PBE-M5-300","Ubiquiti",22,107]
[null,"PBE-M5-300-ISO","Ubiquiti",22,99]
[null,"PBE-M5-400","Ubiquiti",25,102]
[null,"PBE-M5-400-ISO","Ubiquiti",25,88]
[null,"PBE-M5-500","Ubiquiti",27,117]
[null,"PBE-M5-500-ISO","Ubiquiti",27,120]
[null,"PBM3","Ubiquiti",19,129]
[null,"PBM5","Ubiquiti",26,113]
[null,"PrismAP-5-45","Ubiquiti",15.5,155]
[null,"PrismAP-5-60","Ubiquiti",16,160]
[null,"PrismAP-5-90","Ubiquiti",13,156]
[null,"PrismAP530V","Ubiquiti",18,141]
[null,"RD-2G23","Ubiquiti",23,118]
[null,"RD-2G24-AC","Ubiquiti",24,78]
[null,"RD-3G25","Ubiquiti",25.5,123]
[null,"RD-5G30","Ubiquiti",30,87]
[null,"RD-5G30-Lite","Ubiquiti",30,82]
[null,"RD-5G31-AC","Ubiquiti",31,79]
[null,"RD-5G34","Ubiquiti",34,93]